Target
Carbonic anhydrase 2
Ligand
BDBM50079043
Substrate
Meas. Tech.
ChEMBL_45078 (CHEMBL657149)
Ki
28±n/a nM
Citation
 Scozzafava, AMenabuoni, LMincione, FBriganti, FMincione, GSupuran, CT Carbonic anhydrase inhibitors. Synthesis of water-soluble, topically effective, intraocular pressure-lowering aromatic/heterocyclic sulfonamides containing cationic or anionic moieties: is the tail more important than the ring? J Med Chem 42:2641-50 (1999)  
Target
Name:
Carbonic anhydrase 2
Synonyms:
CA-II CAC Carbonate dehydratase II Carbonic anhydrase 2 (CA-II) Carbonic anhydrase C Carbonic anhydrase II (CA-II) Carbonic anhydrase II (hCA II) | Carbonic anhydrase isoenzyme II (hCA II)
Type:
Enzyme
Mol. Mass.:
29250.71
Organism:
Homo sapiens (Human)
Description:
P00918
Residue:
260
  
Inhibitor
Name:
BDBM50079043
Synonyms:
4-Amino-5,6-dichloro-benzene-1,3-disulfonic acid diamide BDBM50222601 | CHEMBL269628
Type:
Small organic molecule
Emp. Form.:
C6H7Cl2N3O4S2
Mol. Mass.:
320.173
SMILES:
Nc1c(Cl)c(Cl)c(cc1S(N)(=O)=O)S(N)(=O)=O
: