Target
Carbonic anhydrase 2
Ligand
BDBM50079058
Substrate
Meas. Tech.
ChEMBL_45078 (CHEMBL657149)
Ki
7±n/a nM
Citation
 Scozzafava, AMenabuoni, LMincione, FBriganti, FMincione, GSupuran, CT Carbonic anhydrase inhibitors. Synthesis of water-soluble, topically effective, intraocular pressure-lowering aromatic/heterocyclic sulfonamides containing cationic or anionic moieties: is the tail more important than the ring? J Med Chem 42:2641-50 (1999)  
Target
Name:
Carbonic anhydrase 2
Synonyms:
CA-II CAC Carbonate dehydratase II Carbonic anhydrase 2 (CA-II) Carbonic anhydrase C Carbonic anhydrase II (CA-II) Carbonic anhydrase II (hCA II) | Carbonic anhydrase isoenzyme II (hCA II)
Type:
Enzyme
Mol. Mass.:
29250.71
Organism:
Homo sapiens (Human)
Description:
P00918
Residue:
260
  
Inhibitor
Name:
BDBM50079058
Synonyms:
6-[3-Methyl-5-sulfamoyl-3H-[1,3,4]thiadiazol-(2Z)-ylidenecarbamoyl]-pyridine-2-carboxylic acid | CHEMBL85120
Type:
Small organic molecule
Emp. Form.:
C10H9N5O5S2
Mol. Mass.:
343.339
SMILES:
Cn1nc(s\c1=N/C(=O)c1cccc(n1)C(O)=O)S(N)(=O)=O
: