Target
Kappa-type opioid receptor
Ligand
BDBM50272036
Substrate
Meas. Tech.
ChEMBL_145851 (CHEMBL756114)
IC50
827±n/a nM
Citation
 Houghten, RAPinilla, CAppel, JRBlondelle, SEDooley, CTEichler, JNefzi, AOstresh, JM Mixture-based synthetic combinatorial libraries. J Med Chem 42:3743-78 (1999)  
Target
Name:
Kappa-type opioid receptor
Synonyms:
K-OR-1 Kappa-opioid receptor (KOR) Kappa-type opioid receptor (KOR) OPIATE Kappa OPRK1 kappa opioid receptor (KOR)
Type:
G Protein-Coupled Receptor (GPCR)
Mol. Mass.:
42648.76
Organism:
Homo sapiens (Human)
Description:
P41145
Residue:
380
  
Inhibitor
Name:
BDBM50272036
Synonyms:
(2R,5S)-1-(2-{bicyclo[2.2.1]heptan-2-yl}ethyl)-5-cyclohexyl-2-(2-methylpropyl)-1H,2H,3H,5H,6H-imidazo[1,2-a]imidazolidin-7-ium
Type:
Small organic molecule
Emp. Form.:
C24H42N3
Mol. Mass.:
372.6098
SMILES:
CC(C)CC1C[N+]2=C(NCC2C2CCCCC2)N1CCC1CC2CCC1C2
: