Target
Tumor necrosis factor
Ligand
BDBM50081355
Substrate
Meas. Tech.
ChEMBL_212403 (CHEMBL816155)
IC50
14000±n/a nM
Citation
 Chao, QDeng, LShih, HLeoni, LMGenini, DCarson, DACottam, HB Substituted isoquinolines and quinazolines as potential antiinflammatory agents. Synthesis and biological evaluation of inhibitors of tumor necrosis factor alpha. J Med Chem 42:3860-73 (1999)  
Target
Name:
Tumor necrosis factor
Synonyms:
Cachectin TNF-a TNFA TNFSF2 Tumor necrosis factor (TNFa) Tumor necrosis factor ligand superfamily member 2 Tumor necrosis factor, soluble form | tumor necrosis factor alpha
Type:
Enzyme
Mol. Mass.:
25645.11
Organism:
Homo sapiens (Human)
Description:
P01375
Residue:
233
  
Inhibitor
Name:
BDBM50081355
Synonyms:
4-(2-Azido-6,7-dimethoxy-4-oxo-4H-quinazolin-3-yl)-butyric acid ethyl ester | CHEMBL127390
Type:
Small organic molecule
Emp. Form.:
C16H19N5O5
Mol. Mass.:
361.3526
SMILES:
CCOC(=O)CCCn1c(N=[N+]=[N-])nc2cc(OC)c(OC)cc2c1=O
: