Target
Aminopeptidase N
Ligand
BDBM50083403
Substrate
Meas. Tech.
ChEMBL_35498 (CHEMBL646408)
Ki
120±n/a nM
Citation
 David, CBischoff, LMeudal, HMothé, ADe Mota, NDaNascimento, SLlorens-Cortes, CFournié-Zaluski, MCRoques, BP Investigation of subsite preferences in aminopeptidase A (EC 3.4.11.7) led to the design of the first highly potent and selective inhibitors of this enzyme. J Med Chem 42:5197-211 (2000)  
Target
Name:
Aminopeptidase N
Synonyms:
AMPN_PIG AP-M Alanyl aminopeptidase Aminopeptidase N (APN) Microsomal aminopeptidase pAPN
Type:
Protein
Mol. Mass.:
108810.25
Organism:
Sus scrofa (Pig)
Description:
P15145
Residue:
963
  
Inhibitor
Name:
BDBM50083403
Synonyms:
3-Carboxy-1-{[1-(1,2-dicarboxy-ethylcarbamoyl)-2-methyl-butylcarbamoyl]-mercapto-methyl}-propyl-ammonium | CHEMBL346397
Type:
Small organic molecule
Emp. Form.:
C16H27N3O8S
Mol. Mass.:
421.466
SMILES:
CC[C@@H](C)[C@H](NC(=O)[C@H](S)[C@@H]([NH3+])CCC([O-])=O)C(=O)N[C@@H](CC(O)=O)C(O)=O
: