Target
Neprilysin
Ligand
BDBM50083393
Substrate
Meas. Tech.
ChEMBL_144468 (CHEMBL755533)
Ki
34±n/a nM
Citation
 David, CBischoff, LMeudal, HMothé, ADe Mota, NDaNascimento, SLlorens-Cortes, CFournié-Zaluski, MCRoques, BP Investigation of subsite preferences in aminopeptidase A (EC 3.4.11.7) led to the design of the first highly potent and selective inhibitors of this enzyme. J Med Chem 42:5197-211 (2000)  
Target
Name:
Neprilysin
Synonyms:
Atriopeptidase CD_antigen=CD10 MME NEP_RABIT Neutral endopeptidase 24.11
Type:
Enzyme
Mol. Mass.:
85570.75
Organism:
Oryctolagus cuniculus (rabbit)
Description:
NEP was purified to homogeneity from rabbit kidney.
Residue:
750
  
Inhibitor
Name:
BDBM50083393
Synonyms:
1-{[1-(1,2-Dicarboxy-ethylcarbamoyl)-2-(4-hydroxy-phenyl)-ethylcarbamoyl]-mercapto-methyl}-3-sulfo-propyl-ammonium | CHEMBL147285
Type:
Small organic molecule
Emp. Form.:
C18H25N3O10S2
Mol. Mass.:
507.535
SMILES:
[NH3+][C@H](CCS([O-])(=O)=O)[C@@H](S)C(=O)N[C@@H](Cc1ccc(O)cc1)C(=O)N[C@@H](CC(O)=O)C(O)=O
: