Target
Glutamyl aminopeptidase
Ligand
BDBM50083381
Substrate
Meas. Tech.
ChEMBL_32830 (CHEMBL873060)
Ki
470±n/a nM
Citation
 David, CBischoff, LMeudal, HMothé, ADe Mota, NDaNascimento, SLlorens-Cortes, CFournié-Zaluski, MCRoques, BP Investigation of subsite preferences in aminopeptidase A (EC 3.4.11.7) led to the design of the first highly potent and selective inhibitors of this enzyme. J Med Chem 42:5197-211 (2000)  
Target
Name:
Glutamyl aminopeptidase
Synonyms:
AMPE_HUMAN Aminopeptidase A Differentiation antigen gp160 ENPEP | Glutamyl aminopeptidase
Type:
PROTEIN
Mol. Mass.:
109226.47
Organism:
Homo sapiens (Human)
Description:
ChEMBL_32829
Residue:
957
  
Inhibitor
Name:
BDBM50083381
Synonyms:
1-{[1-(1-Carbamoyl-2-carboxy-ethylcarbamoyl)-2-methyl-butylcarbamoyl]-mercapto-methyl}-3-sulfo-propyl-ammonium | CHEMBL147410
Type:
Small organic molecule
Emp. Form.:
C15H28N4O8S2
Mol. Mass.:
456.535
SMILES:
CC[C@@H](C)[C@H](NC(=O)[C@@H](S)[C@H]([NH3+])CCS([O-])(=O)=O)C(=O)N[C@@H](CC(O)=O)C(N)=O
: