Target
Angiotensin-converting enzyme
Ligand
BDBM50083385
Substrate
Meas. Tech.
ChEMBL_35381 (CHEMBL647297)
Ki
1090±n/a nM
Citation
 David, CBischoff, LMeudal, HMothé, ADe Mota, NDaNascimento, SLlorens-Cortes, CFournié-Zaluski, MCRoques, BP Investigation of subsite preferences in aminopeptidase A (EC 3.4.11.7) led to the design of the first highly potent and selective inhibitors of this enzyme. J Med Chem 42:5197-211 (2000)  
Target
Name:
Angiotensin-converting enzyme
Synonyms:
ACE_RAT Angiotensin-converting enzyme | Dcp1
Type:
PROTEIN
Mol. Mass.:
150907.81
Organism:
Rattus norvegicus
Description:
ChEMBL_35219
Residue:
1313
  
Inhibitor
Name:
BDBM50083385
Synonyms:
1-{[1-(2,3-Dicarboxy-pyrrolidine-1-carbonyl)-2-methyl-butylcarbamoyl]-mercapto-methyl}-3-sulfo-propyl-ammonium | CHEMBL151631
Type:
Small organic molecule
Emp. Form.:
C17H29N3O9S2
Mol. Mass.:
483.557
SMILES:
CC[C@@H](C)[C@H](NC(=O)[C@H](S)[C@H]([NH3+])CCS([O-])(=O)=O)C(=O)N1CCC([C@@H]1C(O)=O)C(O)=O
: