Target
Kappa-type opioid receptor
Ligand
BDBM50056543
Substrate
Meas. Tech.
ChEMBL_146670 (CHEMBL755873)
Ki
3000±n/a nM
Citation
 Zhang, XRice, KCCalderon, SNKayakiri, HSmith, LCoop, AJacobson, AERothman, RBDavis, PDersch, CMPorreca, F Probes for narcotic receptor mediated phenomena. 26. Synthesis and biological evaluation of diarylmethylpiperazines and diarylmethylpiperidines as novel, nonpeptidic delta opioid receptor ligands. J Med Chem 42:5455-63 (2000)  
Target
Name:
Kappa-type opioid receptor
Synonyms:
Kappa Opioid Receptor OPRK1 Opiate Kappa 1 | mu/kappa opioid receptor
Type:
G Protein-Coupled Receptor (GPCR)
Mol. Mass.:
42744.99
Organism:
Cavia porcellus (domestic guinea pig)
Description:
P41144
Residue:
380
  
Inhibitor
Name:
BDBM50056543
Synonyms:
4-[((1R,2S,5R)-4-Allyl-2,5-dimethyl-piperazin-1-yl)-phenyl-methyl]-N,N-diethyl-benzamide 4-[(S)-((2S,5R)-4-Allyl-2,5-dimethyl-piperazin-1-yl)-phenyl-methyl]-N,N-diethyl-benzamide | CHEMBL153648
Type:
Small organic molecule
Emp. Form.:
C27H37N3O
Mol. Mass.:
419.6022
SMILES:
CCN(CC)C(=O)c1ccc(cc1)C(N1C[C@@H](C)N(CC=C)C[C@@H]1C)c1ccccc1
: