Target
Neuromedin-K receptor
Ligand
BDBM50074794
Substrate
Meas. Tech.
ChEMBL_209565 (CHEMBL811267)
Ki
2.4±n/a nM
Citation
 Giardina, GARaveglia, LFGrugni, MSarau, HMFarina, CMedhurst, ADGraziani, DSchmidt, DBRigolio, RLuttmann, MCavagnera, SFoley, JJVecchietti, VHay, DW Discovery of a novel class of selective non-peptide antagonists for the human neurokinin-3 receptor. 2. Identification of (S)-N-(1-phenylpropyl)-3-hydroxy-2-phenylquinoline-4-carboxamide (SB 223412). J Med Chem 42:1053-65 (1999)  
Target
Name:
Neuromedin-K receptor
Synonyms:
NK-3 receptor NK3R NKR Neurokinin B receptor Neuromedin-3 receptor (NK-3R) Neuromedin-K receptor Neuromedin-K receptor (NK3) TAC3R Tachykinin receptor 3 | Tachykinin receptor 3 (NK3)
Type:
Enzyme
Mol. Mass.:
52221.96
Organism:
Homo sapiens (Human)
Description:
P29371
Residue:
465
  
Inhibitor
Name:
BDBM50074794
Synonyms:
3-Dimethylcarbamoylmethoxy-2-phenyl-quinoline-4-carboxylic acid ((R)-1-phenyl-propyl)-amide | CHEMBL274629
Type:
Small organic molecule
Emp. Form.:
C29H29N3O3
Mol. Mass.:
467.5589
SMILES:
CC[C@@H](NC(=O)c1c(OCC(=O)N(C)C)c(nc2ccccc12)-c1ccccc1)c1ccccc1
: