Target
cGMP-specific 3',5'-cyclic phosphodiesterase
Ligand
BDBM50074896
Substrate
Meas. Tech.
ChEMBL_155195 (CHEMBL763668)
IC50
1000±n/a nM
Citation
 Ukita, TSugahara, MTerakawa, YKuroda, TWada, KNakata, AOhmachi, YKikkawa, HIkezawa, KNaito, K Novel, potent, and selective phosphodiesterase-4 inhibitors as antiasthmatic agents: synthesis and biological activities of a series of 1-pyridylnaphthalene derivatives. J Med Chem 42:1088-99 (1999)  
Target
Name:
cGMP-specific 3',5'-cyclic phosphodiesterase
Synonyms:
3',5'-cyclic phosphodiesterase PDE5 PDE5A_HUMAN Phosphodiesterase 5 (PDE5) Phosphodiesterase 5A (PDE5A) cGMP-specific 3',5'-cyclic phosphodiesterase
Type:
Protein
Mol. Mass.:
99975.83
Organism:
Homo sapiens (Human)
Description:
O76074
Residue:
875
  
Inhibitor
Name:
BDBM50074896
Synonyms:
2-[4-(6-Ethoxy-2,3-bis-hydroxymethyl-7-methoxy-naphthalen-1-yl)-pyridin-2-yl]-4-pyridin-3-yl-2H-phthalazin-1-one; hydrochloride | CHEMBL537465
Type:
Small organic molecule
Emp. Form.:
C33H28N4O5
Mol. Mass.:
560.5992
SMILES:
CCOc1cc2cc(CO)c(CO)c(-c3ccnc(c3)-n3nc(-c4cccnc4)c4ccccc4c3=O)c2cc1OC
: