Target
cGMP-specific 3',5'-cyclic phosphodiesterase
Ligand
BDBM50074889
Substrate
Meas. Tech.
ChEMBL_155195 (CHEMBL763668)
IC50
2000±n/a nM
Citation
 Ukita, TSugahara, MTerakawa, YKuroda, TWada, KNakata, AOhmachi, YKikkawa, HIkezawa, KNaito, K Novel, potent, and selective phosphodiesterase-4 inhibitors as antiasthmatic agents: synthesis and biological activities of a series of 1-pyridylnaphthalene derivatives. J Med Chem 42:1088-99 (1999)  
Target
Name:
cGMP-specific 3',5'-cyclic phosphodiesterase
Synonyms:
3',5'-cyclic phosphodiesterase PDE5 PDE5A_HUMAN Phosphodiesterase 5 (PDE5) Phosphodiesterase 5A (PDE5A) cGMP-specific 3',5'-cyclic phosphodiesterase
Type:
Protein
Mol. Mass.:
99975.83
Organism:
Homo sapiens (Human)
Description:
O76074
Residue:
875
  
Inhibitor
Name:
BDBM50074889
Synonyms:
1-[4-(2,3-Bis-hydroxymethyl-6,7-dimethoxy-naphthalen-1-yl)-pyridin-2-yl]-1H-quinolin-2-one | CHEMBL12383
Type:
Small organic molecule
Emp. Form.:
C28H24N2O5
Mol. Mass.:
468.5006
SMILES:
COc1cc2cc(CO)c(CO)c(-c3ccnc(c3)-n3c4ccccc4ccc3=O)c2cc1OC
: