Target
Prostaglandin G/H synthase 1
Ligand
BDBM11639
Substrate
Meas. Tech.
ChEMBL_158596 (CHEMBL769638)
IC50
50±n/a nM
Citation
 Black, WCBrideau, CChan, CCCharleson, SChauret, NClaveau, DEthier, DGordon, RGreig, GGuay, JHughes, GJolicoeur, PLeblanc, YNicoll-Griffith, DOuimet, NRiendeau, DVisco, DWang, ZXu, LPrasit, P 2,3-Diarylcyclopentenones as orally active, highly selective cyclooxygenase-2 inhibitors. J Med Chem 42:1274-81 (1999)  
Target
Name:
Prostaglandin G/H synthase 1
Synonyms:
COX-1 Cyclooxygenase Cyclooxygenase-1 (COX-1) PTGS1 | Prostaglandin G/H synthase (cyclooxygenase)
Type:
Enzyme
Mol. Mass.:
68692.62
Organism:
Homo sapiens (Human)
Description:
P23219
Residue:
599
  
Inhibitor
Name:
BDBM11639
Synonyms:
4-[5-(4-methylphenyl)-3-(trifluoromethyl)-1H-pyrazol-1-yl]benzene-1-sulfonamide CLX Celecoxib US11478464, Compound Celecoxib US8741944, Comparative Compound cid_2662
Type:
Small organic molecule
Emp. Form.:
C17H14F3N3O2S
Mol. Mass.:
381.372
SMILES:
Cc1ccc(cc1)-c1cc(nn1-c1ccc(cc1)S(N)(=O)=O)C(F)(F)F
: