Target
Adenosine receptor A2b
Ligand
BDBM50369495
Substrate
Meas. Tech.
ChEMBL_30291 (CHEMBL639461)
EC50
37000±n/a nM
Citation
 de Zwart, MKourounakis, AKooijman, HSpek, ALLink, Rvon Frijtag Drabbe Künzel, JKIJzerman, AP 5'-N-substituted carboxamidoadenosines as agonists for adenosine receptors. J Med Chem 42:1384-92 (1999)  
Target
Name:
Adenosine receptor A2b
Synonyms:
AA2BR_HUMAN ADORA2B Adenosine receptors A2b | Adenosine receptors; A2a & A2b
Type:
G Protein-Coupled Receptor (GPCR)
Mol. Mass.:
36341.22
Organism:
Homo sapiens (Human)
Description:
Residue:
332
  
Inhibitor
Name:
BDBM50369495
Synonyms:
CHEMBL606095
Type:
Small organic molecule
Emp. Form.:
C13H18N6O4
Mol. Mass.:
322.3198
SMILES:
CC(C)NC(=O)[C@H]1OC([C@H](O)[C@@H]1O)n1cnc2c(N)ncnc12
: