Target
Adenosine receptor A2a
Ligand
BDBM50241166
Substrate
Meas. Tech.
ChEMBL_30021 (CHEMBL641312)
Ki
733±n/a nM
Citation
 van Tilburg, EWvon Frijtag Drabbe Künzel, Jde Groote, MVollinga, RCLorenzen, AIJzerman, AP N6,5'-Disubstituted adenosine derivatives as partial agonists for the human adenosine A3 receptor. J Med Chem 42:1393-400 (1999)  
Target
Name:
Adenosine receptor A2a
Synonyms:
AA2AR_RAT Adenosine A2 receptor Adenosine Receptors A2a (A2a) Adenosine receptors A2a Rat striatal adenosine A2a receptor
Type:
G Protein-Coupled Receptor (GPCR)
Mol. Mass.:
45015.65
Organism:
Rattus norvegicus (rat)
Description:
Rat A2A receptors expressed in CHO cells.
Residue:
410
  
Inhibitor
Name:
BDBM50241166
Synonyms:
(2R,3R,4S,5R)-2-(6-(benzylamino)-9H-purin-9-yl)-5-(hydroxymethyl)-tetrahydrofuran-3,4-diol N6-benzylado
Type:
Small organic molecule
Emp. Form.:
C17H19N5O4
Mol. Mass.:
357.3639
SMILES:
OC[C@H]1O[C@H]([C@H](O)[C@@H]1O)n1cnc2c(NCc3ccccc3)ncnc12
: