Target
Sodium-dependent serotonin transporter
Ligand
BDBM50063266
Substrate
Meas. Tech.
ChEMBL_201828 (CHEMBL805335)
Ki
0.12±n/a nM
Citation
 Cappelli, AAnzini, MVomero, SCanullo, LMennuni, LMakovec, FDoucet, EHamon, MMenziani, MCDe Benedetti, PGBruni, GRomeo, MRGiorgi, GDonati, A Novel potent and selective central 5-HT3 receptor ligands provided with different intrinsic efficacy. 2. Molecular basis of the intrinsic efficacy of arylpiperazine derivatives at the central 5-HT3 receptors. J Med Chem 42:1556-75 (1999)  
Target
Name:
Sodium-dependent serotonin transporter
Synonyms:
5-HT Transporter 5HT transporter Anandamid membrane transporter, AMT Monoamine transporters; Norepinephrine & serotonin Slc6a4 Sodium-dependent serotonin transporter (SERT) | imipramine receptor
Type:
Multi-pass membrane protein
Mol. Mass.:
70168.43
Organism:
Rattus norvegicus (rat)
Description:
P31652
Residue:
630
  
Inhibitor
Name:
BDBM50063266
Synonyms:
6-Nitro-2-piperazin-1-yl-quinoline CHEMBL41140
Type:
Small organic molecule
Emp. Form.:
C13H14N4O2
Mol. Mass.:
258.2759
SMILES:
[O-][N+](=O)c1ccc2nc(ccc2c1)N1CCNCC1
: