Target
Sodium-dependent serotonin transporter
Ligand
BDBM50088336
Substrate
Meas. Tech.
ChEMBL_201200 (CHEMBL802164)
Ki
0.56±n/a nM
Citation
 Hoepping, AJohnson, KMGeorge, CFlippen-Anderson, JKozikowski, AP Novel conformationally constrained tropane analogues by 6-endo-trig radical cyclization and stille coupling - switch of activity toward the serotonin and/or norepinephrine transporter. J Med Chem 43:2064-71 (2000)  
Target
Name:
Sodium-dependent serotonin transporter
Synonyms:
5-HT Transporter 5HTT SC6A4_HUMAN SLC6A4 Serotonin transporter (5HTT) Sodium-dependent serotonin transporter (SERT) | Solute carrier family 6 member 4
Type:
Multi-pass membrane protein
Mol. Mass.:
70322.51
Organism:
Homo sapiens (Human)
Description:
P31645
Residue:
630
  
Inhibitor
Name:
BDBM50088336
Synonyms:
9-(3,4-Dichloro-benzylidene)-7-aza-tricyclo[4.3.1.0*3,7*]decane-2-carboxylic acid methyl ester | CHEMBL304656
Type:
Small organic molecule
Emp. Form.:
C18H19Cl2NO2
Mol. Mass.:
352.255
SMILES:
COC(=O)[C@H]1C2CC[C@@H]3C[C@@H]1\C(CN23)=C\c1ccc(Cl)c(Cl)c1
: