Target
Metabotropic glutamate receptor 4
Ligand
BDBM50060134
Substrate
Meas. Tech.
ChEMBL_106560 (CHEMBL716502)
Ki
8800±n/a nM
Citation
 Bräuner-Osborne, HEgebjerg, JNielsen, EOMadsen, UKrogsgaard-Larsen, P Ligands for glutamate receptors: design and therapeutic prospects. J Med Chem 43:2609-45 (2000)  
Target
Name:
Metabotropic glutamate receptor 4
Synonyms:
GPRC1D GRM4_HUMAN MGLUR4 Metabotropic glutamate receptor 4 (mGlu4) metabotropic glutamate 4
Type:
Protein
Mol. Mass.:
101899.95
Organism:
Homo sapiens (Human)
Description:
Q14833
Residue:
912
  
Inhibitor
Name:
BDBM50060134
Synonyms:
(1S,2S)-4-Amino-cyclopentane-1,2,4-tricarboxylic acid 4-Amino-cyclopentane-1,2,4-tricarboxylic acid(3S,4S-ACPT-III) | CHEMBL329236
Type:
Small organic molecule
Emp. Form.:
C8H11NO6
Mol. Mass.:
217.176
SMILES:
NC1(C[C@@H]([C@H](C1)C(O)=O)C(O)=O)C(O)=O
: