Target
Adenosine receptor A1
Ligand
BDBM50090700
Substrate
Meas. Tech.
ChEMBL_29105 (CHEMBL638717)
Ki
0.70±n/a nM
Citation
 Ferrarini, PLMori, CManera, CMartinelli, AMori, FSaccomanni, GBarili, PLBetti, LGiannaccini, GTrincavelli, LLucacchini, A A novel class of highly potent and selective A1 adenosine antagonists: structure-affinity profile of a series of 1,8-naphthyridine derivatives. J Med Chem 43:2814-23 (2000)  
Target
Name:
Adenosine receptor A1
Synonyms:
AA1R_BOVIN ADENOSINE A1 high ADORA1 | Adenosine A1 receptor
Type:
Enzyme Catalytic Domain
Mol. Mass.:
36602.99
Organism:
BOVINE
Description:
ADENOSINE 0 BOVINE::P28190
Residue:
326
  
Inhibitor
Name:
BDBM50090700
Synonyms:
7-Bromo-2-phenyl-[1,8]naphthyridin-4-ol CHEMBL97687
Type:
Small organic molecule
Emp. Form.:
C14H9BrN2O
Mol. Mass.:
301.138
SMILES:
Oc1cc(nc2nc(Br)ccc12)-c1ccccc1
: