Target
D(2) dopamine receptor
Ligand
BDBM50017543
Substrate
Meas. Tech.
ChEMBL_62066 (CHEMBL672366)
Kd
40±n/a nM
Citation
 Wilcox, REHuang, WHBrusniak, MYWilcox, DMPearlman, RSTeeter, MMDuRand, CJWiens, BLNeve, KA CoMFA-based prediction of agonist affinities at recombinant wild type versus serine to alanine point mutated D2 dopamine receptors. J Med Chem 43:3005-19 (2000)  
Target
Name:
D(2) dopamine receptor
Synonyms:
DOPAMINE D2 DOPAMINE D2 Short Dopamine D2 receptor Drd2
Type:
G Protein-Coupled Receptor (GPCR)
Mol. Mass.:
50931.60
Organism:
Rattus norvegicus (rat)
Description:
P61169
Residue:
444
  
Inhibitor
Name:
BDBM50017543
Synonyms:
(6aR,9R,10aR)-9-Methylsulfanylmethyl-7-propyl-4,6,6a,7,8,9,10,10a-octahydro-indolo[4,3-fg]quinolin-7-ium 5-Bromo-7-methyl-4,6,6a,7,8,9-hexahydro-indolo[4,3-fg]quinoline-9-carboxylic acid (10b-hydroxy-5-isobutyl-2-isopropyl-3,6-dioxo-octahydro-oxazolo[3,2-a]pyrrolo[2,1-c]pyrazin-2-yl)-amide 9-Methylsulfanylmethyl-7-propyl-4,6,6a,7,8,9,10,10a-octahydro-indolo[4,3-fg]quinoline 9-Methylsulfanylmethyl-7-propyl-4,6,6a,7,8,9,10,10a-octahydro-indolo[4,3-fg]quinoline, mesylate (Pergolide) PERGOLIDE [2-(1H-Indol-4-yl)-ethyl]-methyl-amine | cid_47811
Type:
Small organic molecule
Emp. Form.:
C19H26N2S
Mol. Mass.:
314.488
SMILES:
CCCN1C[C@H](CSC)C[C@H]2[C@H]1Cc1c[nH]c3cccc2c13
: