Target
Androgen receptor
Ligand
BDBM50091400
Substrate
Meas. Tech.
ChEMBL_36428 (CHEMBL649839)
Ki
2.2±n/a nM
Citation
 Van Dort, MERobins, DMWayburn, B Design, synthesis, and pharmacological characterization of 4-[4, 4-dimethyl-3-(4-hydroxybutyl)-5-oxo-2-thioxo-1-imidazolidinyl]- 2-iodobenzonitrile as a high-affinity nonsteroidal androgen receptor ligand. J Med Chem 43:3344-7 (2000)  
Target
Name:
Androgen receptor
Synonyms:
ANDR_RAT Ar Nr3c4 | androgen
Type:
Enzyme
Mol. Mass.:
98219.08
Organism:
Rattus norvegicus (Rat)
Description:
P15207
Residue:
902
  
Inhibitor
Name:
BDBM50091400
Synonyms:
4-(3-(4-hydroxybutyl)-4,4-dimethyl-5-oxo-2-thioxoimidazolidin-1-yl)-2-(trifluoromethyl)benzonitrile CHEMBL331820 | RU-59063
Type:
Small organic molecule
Emp. Form.:
C17H18F3N3O2S
Mol. Mass.:
385.404
SMILES:
CC1(C)N(CCCCO)C(=S)N(C1=O)c1ccc(C#N)c(c1)C(F)(F)F
: