Target
Gag-Pol polyprotein [489-587]
Ligand
BDBM50091608
Substrate
Meas. Tech.
ChEMBL_159325 (CHEMBL769378)
IC50
0.19±n/a nM
Citation
 Dorsey, BDMcDonough, CMcDaniel, SLLevin, RBNewton, CLHoffman, JMDarke, PLZugay-Murphy, JAEmini, EASchleif, WAOlsen, DBStahlhut, MWRutkowski, CAKuo, LCLin, JHChen, IWMichelson, SRHolloway, MKHuff, JRVacca, JP Identification of MK-944a: a second clinical candidate from the hydroxylaminepentanamide isostere series of HIV protease inhibitors. J Med Chem 43:3386-99 (2000)  
Target
Name:
Gag-Pol polyprotein [489-587]
Synonyms:
Human immunodeficiency virus type 1 protease Pol polyprotein | gag-pol
Type:
Enzyme Subunit
Mol. Mass.:
10781.16
Organism:
Human immunodeficiency virus type 1
Description:
P04585[489-587]
Residue:
99
  
Inhibitor
Name:
BDBM50091608
Synonyms:
1-[2-Hydroxy-4-(2-hydroxy-indan-1-ylcarbamoyl)-5-phenyl-pentyl]-4-(6-methyl-furo[3,2-c]pyridin-2-ylmethyl)-piperazine-2-carboxylic acid tert-butylamide | CHEMBL325013
Type:
Small organic molecule
Emp. Form.:
C39H49N5O5
Mol. Mass.:
667.8369
SMILES:
Cc1cc2oc(CN3CCN(C[C@@H](O)C[C@@H](Cc4ccccc4)C(=O)NC4[C@H](O)Cc5ccccc45)[C@@H](C3)C(=O)NC(C)(C)C)cc2cn1
: