Target
D(3) dopamine receptor
Ligand
BDBM50092170
Substrate
Meas. Tech.
ChEMBL_62615 (CHEMBL678238)
EC50
>1000±n/a nM
Citation
 van Vliet, LARodenhuis, NWikström, HPugsley, TASerpa, KAMeltzer, LTHeffner, TGWise, LDLajiness, MEHuff, RMSvensson, KHaenen, GRBast, A Thiazoloindans and thiazolobenzopyrans: a novel class of orally active central dopamine (partial) agonists. J Med Chem 43:3549-57 (2000)  
Target
Name:
D(3) dopamine receptor
Synonyms:
DOPAMINE D3 Dopamine D3 receptor | Drd3
Type:
Protein
Mol. Mass.:
49540.58
Organism:
Rattus norvegicus (Rat)
Description:
P19020
Residue:
446
  
Inhibitor
Name:
BDBM50092170
Synonyms:
CHEMBL116372 | N*8*,N*8*-Dipropyl-8,9-dihydro-7H-chromeno[6,5-d]thiazole-2,8-diamine
Type:
Small organic molecule
Emp. Form.:
C16H23N3OS
Mol. Mass.:
305.438
SMILES:
CCCN(CCC)C1COc2ccc3nc(N)sc3c2C1
: