Target
Steroid 17-alpha-hydroxylase/17,20 lyase
Ligand
BDBM50093591
Substrate
Meas. Tech.
ChEMBL_50357 (CHEMBL662517)
IC50
200±n/a nM
Citation
 Hartmann, RWHector, MHaidar, SEhmer, PBReichert, WJose, J Synthesis and evaluation of novel steroidal oxime inhibitors of P450 17 (17 alpha-hydroxylase/C17-20-lyase) and 5 alpha-reductase types 1 and 2. J Med Chem 43:4266-77 (2000)  
Target
Name:
Steroid 17-alpha-hydroxylase/17,20 lyase
Synonyms:
CP17A_HUMAN CYP17A1 Cytochrome P450 17A1 Cytochrome P450 C17 (CYP17) Cytochrome P450-C17 P450-C17 Steroid 17-alpha-Monooxygenase (CYP17) Steroid 17-alpha-monooxygenase | cytochrome P450 monooxygenase 17 alpha hydroxylase/17,20-lyase (CYP17)
Type:
Enzyme
Mol. Mass.:
57382.42
Organism:
Homo sapiens (Human)
Description:
E.coli expressing human CYP17
Residue:
508
  
Inhibitor
Name:
BDBM50093591
Synonyms:
17-(1-Hydroxyimino-ethyl)-10,13-dimethyl-1,2,6,7,8,9,10,11,12,13-decahydro-cyclopenta[a]phenanthren-3-one | CHEMBL135288
Type:
Small organic molecule
Emp. Form.:
C21H27NO2
Mol. Mass.:
325.4446
SMILES:
CC(N=O)C1=CC=C2C3CCC4=CC(=O)CCC4(C)C3CCC12C
: