Target
Carbonic anhydrase 2
Ligand
BDBM50094403
Substrate
Meas. Tech.
ChEMBL_45236 (CHEMBL657194)
Ki
0.5±n/a nM
Citation
 Scozzafava, AMenabuoni, LMincione, FBriganti, FMincione, GSupuran, CT Carbonic anhydrase inhibitors: perfluoroalkyl/aryl-substituted derivatives of aromatic/heterocyclic sulfonamides as topical intraocular pressure-lowering agents with prolonged duration of action. J Med Chem 43:4542-51 (2000)  
Target
Name:
Carbonic anhydrase 2
Synonyms:
CA-II CAC Carbonate dehydratase II Carbonic anhydrase 2 (CA-II) Carbonic anhydrase C Carbonic anhydrase II (CA-II) Carbonic anhydrase II (hCA II) | Carbonic anhydrase isoenzyme II (hCA II)
Type:
Enzyme
Mol. Mass.:
29250.71
Organism:
Homo sapiens (Human)
Description:
P00918
Residue:
260
  
Inhibitor
Name:
BDBM50094403
Synonyms:
2,3,4,5,6-Pentafluoro-N-(2-sulfamoyl-benzothiazol-6-yl)-benzamide | CHEMBL343916
Type:
Small organic molecule
Emp. Form.:
C14H6F5N3O3S2
Mol. Mass.:
423.338
SMILES:
NS(=O)(=O)c1nc2ccc(NC(=O)c3c(F)c(F)c(F)c(F)c3F)cc2s1
: