Target
Sodium-dependent noradrenaline transporter
Ligand
BDBM50095611
Substrate
Meas. Tech.
ChEMBL_142785 (CHEMBL752160)
Ki
21±n/a nM
Citation
 Froimowitz, MWu, KMMoussa, AHaidar, RMJurayj, JGeorge, CGardner, EL Slow-onset, long-duration 3-(3',4'-dichlorophenyl)-1-indanamine monoamine reuptake blockers as potential medications to treat cocaine abuse. J Med Chem 43:4981-92 (2001)  
Target
Name:
Sodium-dependent noradrenaline transporter
Synonyms:
Monoamine transporter NET Noradrenaline Transporter (NET) Norepinephrine transporter protein (NET) SLC6A2 Sodium-dependent noradrenaline transporter (NET) | Solute carrier family 6 member 2
Type:
Multi-pass membrane protein
Mol. Mass.:
69337.72
Organism:
Homo sapiens (Human)
Description:
P23975
Residue:
617
  
Inhibitor
Name:
BDBM50095611
Synonyms:
CHEMBL356750 [3-(3,4-Dichloro-phenyl)-indan-1-yl]-ethyl-amine;chloride | tert-Butyl-[3-(3,4-dichloro-phenyl)-indan-1-yl]-amine;chloride
Type:
Small organic molecule
Emp. Form.:
C17H17Cl2N
Mol. Mass.:
306.23
SMILES:
CN(C)[C@@H]1C[C@H](c2ccccc12)c1ccc(Cl)c(Cl)c1
: