Target
Delta-type opioid receptor
Ligand
BDBM50033535
Substrate
Meas. Tech.
ChEMBL_147335 (CHEMBL756180)
Ki
103±n/a nM
Citation
 Subramanian, GPaterlini, MGPortoghese, PSFerguson, DM Molecular docking reveals a novel binding site model for fentanyl at the mu-opioid receptor. J Med Chem 43:381-91 (2000)  
Target
Name:
Delta-type opioid receptor
Synonyms:
D-OR-1 Delta opioid receptor OPIATE Delta OPRD1 OPRK1 | opioid receptor, delta 1
Type:
G Protein-Coupled Receptor (GPCR)
Mol. Mass.:
40382.98
Organism:
Homo sapiens (Human)
Description:
Competition binding assays were carried out using membrane preparations from transfected HN9.10 cells that constitutively expressed the delta opioid receptor.
Residue:
372
  
Inhibitor
Name:
BDBM50033535
Synonyms:
CHEMBL331883 N-[1-(2-Hydroxy-2-phenyl-ethyl)-3-methyl-piperidin-4-yl]-N-phenyl-propionamide(2'R,3R,4S)-cis-ohmefentanyl
Type:
Small organic molecule
Emp. Form.:
C23H30N2O2
Mol. Mass.:
366.4965
SMILES:
CCC(=O)N([C@H]1CCN(C[C@H](O)c2ccccc2)C[C@H]1C)c1ccccc1
: