Target
Kappa-type opioid receptor
Ligand
BDBM50012477
Substrate
Meas. Tech.
ChEMBL_145955 (CHEMBL752204)
Ki
43±n/a nM
Citation
 Subramanian, GPaterlini, MGPortoghese, PSFerguson, DM Molecular docking reveals a novel binding site model for fentanyl at the mu-opioid receptor. J Med Chem 43:381-91 (2000)  
Target
Name:
Kappa-type opioid receptor
Synonyms:
K-OR-1 Kappa-opioid receptor (KOR) Kappa-type opioid receptor (KOR) OPIATE Kappa OPRK1 kappa opioid receptor (KOR)
Type:
G Protein-Coupled Receptor (GPCR)
Mol. Mass.:
42648.76
Organism:
Homo sapiens (Human)
Description:
P41145
Residue:
380
  
Inhibitor
Name:
BDBM50012477
Synonyms:
1-Phenethyl-4-(phenyl-propionyl-amino)-piperidine-4-carboxylic acid methyl ester CARFENTANIL Carfentanil1-Phenethyl-4-(phenyl-propionyl-amino)-piperidine-4-carboxylic acid methyl ester | US20230399418, Compound Carfentanil
Type:
Small organic molecule
Emp. Form.:
C24H30N2O3
Mol. Mass.:
394.5066
SMILES:
CCC(=O)N(c1ccccc1)C1(CCN(CCc2ccccc2)CC1)C(=O)OC
: