Target
cAMP-specific 3',5'-cyclic phosphodiesterase 4B
Ligand
BDBM14361
Substrate
Meas. Tech.
ChEMBL_155173 (CHEMBL761911)
IC50
2700±n/a nM
Citation
 Hersperger, RBray-French, KMazzoni, LMüller, T Palladium-catalyzed cross-coupling reactions for the synthesis of 6, 8-disubstituted 1,7-naphthyridines: a novel class of potent and selective phosphodiesterase type 4D inhibitors. J Med Chem 43:675-82 (2000)  
Target
Name:
cAMP-specific 3',5'-cyclic phosphodiesterase 4B
Synonyms:
DPDE4 Pde4b | Phosphodiesterase 4B
Type:
Enzyme Catalytic Domain
Mol. Mass.:
83349.50
Organism:
RAT
Description:
P14646
Residue:
736
  
Inhibitor
Name:
BDBM14361
Synonyms:
(R,S)-Rolipram 4-[3-(cyclopentyloxy)-4-methoxyphenyl]pyrrolidin-2-one CHEMBL63 | Rolipram
Type:
Small organic molecule
Emp. Form.:
C16H21NO3
Mol. Mass.:
275.3428
SMILES:
COc1ccc(cc1OC1CCCC1)C1CNC(=O)C1
: