Target
Glutamate receptor ionotropic, NMDA 1/2B
Ligand
BDBM50007400
Substrate
Meas. Tech.
ChEMBL_143318 (CHEMBL753020)
IC50
2200±n/a nM
Citation
 Guzikowski, APTamiz, APAcosta-Burruel, MHong-Bae, SCai, SXHawkinson, JEKeana, JFKesten, SRShipp, CTTran, MWhittemore, ERWoodward, RMWright, JLZhou, ZL Synthesis of N-substituted 4-(4-hydroxyphenyl)piperidines, 4-(4-hydroxybenzyl)piperidines, and (+/-)-3-(4-hydroxyphenyl)pyrrolidines: selective antagonists at the 1A/2B NMDA receptor subtype. J Med Chem 43:984-94 (2000)  
Target
Name:
Glutamate receptor ionotropic, NMDA 1/2B
Synonyms:
Glutamate NMDA receptor; Grin1/Grin2b | Glutamate [NMDA] receptor subunit epsilon 2/zeta 1
Type:
Mol. Mass.:
Description:
ASSAY_ID of EBI is 141026
Components:
This complex has 2 components.
Component 1
Name:
Glutamate receptor ionotropic, NMDA 2B
Synonyms:
GluN2B Grin2b NMDA receptor subunit N2B (GluN2B) NMDE2_RAT | NR2B
Type:
Protein
Mol. Mass.:
166077.66
Organism:
Rattus norvegicus (Rat)
Description:
Q00960
Residue:
1482
  
Component 2
Name:
Glutamate receptor ionotropic, NMDA 1
Synonyms:
Glutamate (NMDA) receptor subunit zeta 1 Glutamate-NMDA-Channel Glutamate-NMDA-Polyamine NMDA Nmdar1 | phencyclidine
Type:
Enzyme Catalytic Domain
Mol. Mass.:
105533.40
Organism:
RAT
Description:
P35439
Residue:
938
  
Inhibitor
Name:
BDBM50007400
Synonyms:
4-Phenyl-1-(4-phenyl-butyl)-piperidine CHEMBL1788131 | CHEMBL325238
Type:
Small organic molecule
Emp. Form.:
C21H27N
Mol. Mass.:
293.4458
SMILES:
C(CCc1ccccc1)CN1CCC(CC1)c1ccccc1
: