Target
Glutamate receptor ionotropic, NMDA 1/2C
Ligand
BDBM50369782
Substrate
Meas. Tech.
ChEMBL_143327 (CHEMBL752245)
IC50
>100000±n/a nM
Citation
 Guzikowski, APTamiz, APAcosta-Burruel, MHong-Bae, SCai, SXHawkinson, JEKeana, JFKesten, SRShipp, CTTran, MWhittemore, ERWoodward, RMWright, JLZhou, ZL Synthesis of N-substituted 4-(4-hydroxyphenyl)piperidines, 4-(4-hydroxybenzyl)piperidines, and (+/-)-3-(4-hydroxyphenyl)pyrrolidines: selective antagonists at the 1A/2B NMDA receptor subtype. J Med Chem 43:984-94 (2000)  
Target
Name:
Glutamate receptor ionotropic, NMDA 1/2C
Synonyms:
Glutamate NMDA receptor; Grin1/Grin2c | Glutamate [NMDA] receptor subunit epsilon 3/zeta 1
Type:
Mol. Mass.:
Description:
ASSAY_ID of EBI is 141029
Components:
This complex has 2 components.
Component 1
Name:
Glutamate receptor ionotropic, NMDA 1
Synonyms:
Glutamate (NMDA) receptor subunit zeta 1 Glutamate-NMDA-Channel Glutamate-NMDA-Polyamine NMDA Nmdar1 | phencyclidine
Type:
Enzyme Catalytic Domain
Mol. Mass.:
105533.40
Organism:
RAT
Description:
P35439
Residue:
938
  
Component 2
Name:
Glutamate receptor ionotropic, NMDA 2C
Synonyms:
Glutamate NMDA receptor; Grin1/Grin2c Grin2c NMDE3_RAT
Type:
Protein
Mol. Mass.:
135305.94
Organism:
Rattus norvegicus (Rat)
Description:
Q00961
Residue:
1237
  
Inhibitor
Name:
BDBM50369782
Synonyms:
CHEMBL1203909
Type:
Small organic molecule
Emp. Form.:
C20H25NO
Mol. Mass.:
295.4186
SMILES:
Oc1ccc(cc1)C1CCN(CCCc2ccccc2)CC1
: