Target
Glucagon receptor
Ligand
BDBM50087843
Substrate
Meas. Tech.
ChEMBL_70921 (CHEMBL683739)
IC50
130±n/a nM
Citation
 Trivedi, DLin, YAhn, JMSiegel, MMollova, NNSchram, KHHruby, VJ Design and synthesis of conformationally constrained glucagon analogues. J Med Chem 43:1714-22 (2000)  
Target
Name:
Glucagon receptor
Synonyms:
GL-R Gcgr
Type:
PROTEIN
Mol. Mass.:
55053.40
Organism:
Rattus norvegicus
Description:
ChEMBL_1450588
Residue:
485
  
Inhibitor
Name:
BDBM50087843
Synonyms:
CHEMBL429724 | c[Asp9, Lys12,] glucagon-NH2
Type:
Small organic molecule
Emp. Form.:
C153H224N44O47S
Mol. Mass.:
3463.747
SMILES:
CSCC[C@@H](NC(=O)[C@@H](CC(C)C)NC(=O)[C@@H](Cc1c[nH]c2ccccc12)NC(=O)[C@@H](CCC(N)=O)NC(=O)[C@H](NC(=O)[C@@H](Cc1ccccc1)NC(=O)[C@@H](CC(O)=O)NC(=O)[C@@H](CCC(N)=O)NC(=O)[C@@H](C)NC(=O)[C@@H](CCCNC(N)=N)NC(=O)[C@@H](CCCNC(N)=N)NC(=O)[C@@H](CO)NC(=O)[C@@H](CC(O)=O)NC(=O)[C@@H](CC(C)C)NC(=O)[C@H](Cc1ccc(O)cc1)NC(=O)[C@H]1CCCCNC(=O)C[C@H](NC(=O)[C@H](CO)NC(=O)[C@H](NC(=O)[C@@H](Cc2ccccc2)NC(=O)[C@H](NC(=O)CNC(=O)[C@@H](CCC(N)=O)NC(=O)[C@@H](CO)NC(=O)[C@H](N)Cc2cnc[nH]2)[C@H](C)O)[C@H](C)O)C(=O)N[C@@H](Cc2ccc(O)cc2)C(=O)N[C@H](CO)C(=O)N1)C(C)C)C(=O)N[C@H](CC(N)=O)C(=O)N[C@H]([C@H](C)O)C(N)=O
: