Target
Glucagon receptor
Ligand
BDBM50087848
Substrate
Meas. Tech.
ChEMBL_73011 (CHEMBL681690)
EC50
320±n/a nM
Citation
 Trivedi, DLin, YAhn, JMSiegel, MMollova, NNSchram, KHHruby, VJ Design and synthesis of conformationally constrained glucagon analogues. J Med Chem 43:1714-22 (2000)  
Target
Name:
Glucagon receptor
Synonyms:
GL-R Gcgr
Type:
PROTEIN
Mol. Mass.:
55053.40
Organism:
Rattus norvegicus
Description:
ChEMBL_1450588
Residue:
485
  
Inhibitor
Name:
BDBM50087848
Synonyms:
CHEMBL427644 | c[Asp15, Lys18,] glucagon-NH2
Type:
Small organic molecule
Emp. Form.:
C154H226N40O47S
Mol. Mass.:
3421.747
SMILES:
CSCC[C@@H](NC(=O)[C@@H](CC(C)C)NC(=O)[C@@H](Cc1c[nH]c2ccccc12)NC(=O)[C@@H](CCC(N)=O)NC(=O)[C@H](NC(=O)[C@H](Cc1ccccc1)NC(=O)[C@H]1CCC(=O)NCCCC[C@H](NC(=O)[C@H](CCCCN)NC(=O)[C@@H](CO)NC(=O)[C@@H](CC(O)=O)NC(=O)[C@@H](CC(C)C)NC(=O)[C@@H](Cc2ccc(O)cc2)NC(=O)[C@@H](CCCCN)NC(=O)[C@@H](CO)NC(=O)[C@@H](Cc2ccc(O)cc2)NC(=O)[C@@H](CC(O)=O)NC(=O)[C@@H](CO)NC(=O)[C@H](NC(=O)[C@@H](Cc2ccccc2)NC(=O)[C@H](NC(=O)CNC(=O)[C@@H](CCC(N)=O)NC(=O)[C@@H](CO)NC(=O)[C@H](N)Cc2cnc[nH]2)[C@H](C)O)[C@H](C)O)C(=O)N[C@@H](C)C(=O)N[C@H](CCC(N)=O)C(=O)N1)C(C)C)C(=O)N[C@H](CC(N)=O)C(=O)N[C@H]([C@H](C)O)C(N)=O
: