Target
Matrix metalloproteinase-9
Ligand
BDBM50076993
Substrate
Meas. Tech.
ChEMBL_105380 (CHEMBL710800)
Ki
13±n/a nM
Citation
 Xue, CBVoss, MENelson, DJDuan, JJCherney, RJJacobson, ICHe, XRoderick, JChen, LCorbett, RLWang, LMeyer, DTKennedy, KDeGradodagger, WFHardman, KDTeleha, CAJaffee, BDLiu, RQCopeland, RACovington, MBChrist, DDTrzaskos, JMNewton, RCMagolda, RLWexler, RRDecicco, CP Design, synthesis, and structure-activity relationships of macrocyclic hydroxamic acids that inhibit tumor necrosis factor alpha release in vitro and in vivo. J Med Chem 44:2636-60 (2001)  
Target
Name:
Matrix metalloproteinase-9
Synonyms:
67 kDa matrix metalloproteinase-9 92 kDa gelatinase CLG4B Gelatinase B MMP9 Matrix metalloproteinase 9 (MMP-9) Matrix metalloproteinase-9 (MMP9)
Type:
Enzyme
Mol. Mass.:
78452.28
Organism:
Homo sapiens (Human)
Description:
P14780
Residue:
707
  
Inhibitor
Name:
BDBM50076993
Synonyms:
(2S,11S,12R)-12-Isobutyl-13-oxo-1,7diaza-cyclotridecane-2,11-dicarboxylic acid 11-hydroxyamide 2-methylamide; hydrochloride CHEMBL88220
Type:
Small organic molecule
Emp. Form.:
C18H34N4O4
Mol. Mass.:
370.487
SMILES:
CNC(=O)[C@@H]1CCCCNCCC[C@@H]([C@@H](CC(C)C)C(=O)N1)C(=O)NO
: