Target
Adenosine receptor A2a
Ligand
BDBM21220
Substrate
Meas. Tech.
ChEMBL_30003 (CHEMBL641294)
Ki
4.13±n/a nM
Citation
 Umino, TYoshioka, KSaitoh, YMinakawa, NNakata, HMatsuda, A Nucleosides and nucleotides. 200. Reinvestigation of 5'-N-ethylcarboxamidoadenosine derivatives: structure-activity relationships for P(3) purinoceptor-like proteins. J Med Chem 44:208-14 (2001)  
Target
Name:
Adenosine receptor A2a
Synonyms:
AA2AR_RAT Adenosine A2 receptor Adenosine Receptors A2a (A2a) Adenosine receptors A2a Rat striatal adenosine A2a receptor
Type:
G Protein-Coupled Receptor (GPCR)
Mol. Mass.:
45015.65
Organism:
Rattus norvegicus (rat)
Description:
Rat A2A receptors expressed in CHO cells.
Residue:
410
  
Inhibitor
Name:
BDBM21220
Synonyms:
(2S,3S,4R,5R)-5-(6-amino-9H-purin-9-yl)-N-ethyl-3,4-dihydroxyoxolane-2-carboxamide Adenosine, N6-Ethyl-carboxamido CHEMBL464859 NECA
Type:
Antineoplastic Agent
Emp. Form.:
C12H16N6O4
Mol. Mass.:
308.2932
SMILES:
CCNC(=O)[C@H]1O[C@H]([C@H](O)[C@@H]1O)n1cnc2c(N)ncnc12
: