Target
Kappa-type opioid receptor
Ligand
BDBM82507
Substrate
Meas. Tech.
ChEMBL_145105 (CHEMBL751989)
IC50
512±n/a nM
Citation
 Poulain, RHorvath, DBonnet, BEckhoff, CChapelain, BBodinier, MCDéprez, B From hit to lead. Combining two complementary methods for focused library design. Application to mu opiate ligands. J Med Chem 44:3378-90 (2001)  
Target
Name:
Kappa-type opioid receptor
Synonyms:
K-OR-1 Kappa-opioid receptor (KOR) Kappa-type opioid receptor (KOR) OPIATE Kappa OPRK1 kappa opioid receptor (KOR)
Type:
G Protein-Coupled Receptor (GPCR)
Mol. Mass.:
42648.76
Organism:
Homo sapiens (Human)
Description:
P41145
Residue:
380
  
Inhibitor
Name:
BDBM82507
Synonyms:
(+/-)-Methadone METHADONE NSC_22266
Type:
Small organic molecule
Emp. Form.:
C21H27NO
Mol. Mass.:
309.4452
SMILES:
CCC(=O)C(CC(C)N(C)C)(c1ccccc1)c1ccccc1
: