Target
D(1B) dopamine receptor
Ligand
BDBM50105101
Substrate
Meas. Tech.
ChEMBL_61330 (CHEMBL675948)
IC50
1550±n/a nM
Citation
 Poulain, RHorvath, DBonnet, BEckhoff, CChapelain, BBodinier, MCDéprez, B From hit to lead. Analyzing structure-profile relationships. J Med Chem 44:3391-401 (2001)  
Target
Name:
D(1B) dopamine receptor
Synonyms:
D(5) dopamine receptor DOPAMINE D5 DRD1L2 DRD5_HUMAN | dopamine receptor D5
Type:
Protein
Mol. Mass.:
52943.41
Organism:
Homo sapiens (Human)
Description:
P21918
Residue:
477
  
Inhibitor
Name:
BDBM50105101
Synonyms:
4-[4,4-Bis-(4-fluoro-phenyl)-butyl]-piperazine-1-carboxylic acid 2-(4-fluoro-phenyl)-ethyl ester | CHEMBL325516
Type:
Small organic molecule
Emp. Form.:
C29H31F3N2O2
Mol. Mass.:
496.5638
SMILES:
Fc1ccc(CCOC(=O)N2CCN(CCCC(c3ccc(F)cc3)c3ccc(F)cc3)CC2)cc1
: