Target
Adenosine transporter 1
Ligand
BDBM50105137
Substrate
Meas. Tech.
ChEMBL_149711 (CHEMBL755808)
Ki
600±n/a nM
Citation
 Klenke, BStewart, MBarrett, MPBrun, RGilbert, IH Synthesis and biological evaluation of s-triazine substituted polyamines as potential new anti-trypanosomal drugs. J Med Chem 44:3440-52 (2001)  
Target
Name:
Adenosine transporter 1
Synonyms:
Type:
PROTEIN
Mol. Mass.:
51044.02
Organism:
Trypanosoma brucei
Description:
ChEMBL_31141
Residue:
463
  
Inhibitor
Name:
BDBM50105137
Synonyms:
CHEMBL545281 | N-{3-[12-(3-Amino-propylamino)-dodecylamino]-propyl}-N',N',N'',N''-tetramethyl-[1,3,5]triazine-2,4,6-triaminepentahydrochloride
Type:
Small organic molecule
Emp. Form.:
C25H53N9
Mol. Mass.:
479.7486
SMILES:
CN(C)c1nc(NCCCNCCCCCCCCCCCCNCCCN)nc(n1)N(C)C
: