Target
Adenosine receptor A1
Ligand
BDBM50106535
Substrate
Meas. Tech.
ChEMBL_29013 (CHEMBL643487)
Ki
8.1±n/a nM
Citation
 Jacobson, KAGao, ZGChen, ABarak, DKim, SALee, KLink, ARompaey, PVvan Calenbergh, SLiang, BT Neoceptor concept based on molecular complementarity in GPCRs: a mutant adenosine A(3) receptor with selectively enhanced affinity for amine-modified nucleosides. J Med Chem 44:4125-36 (2001)  
Target
Name:
Adenosine receptor A1
Synonyms:
AA1R_RAT ADENOSINE A1 high Adenosine A1 receptor (A1) Adenosine receptors A1 | Adora1
Type:
Protein
Mol. Mass.:
36704.13
Organism:
Rattus norvegicus (rat)
Description:
Residue:
326
  
Inhibitor
Name:
BDBM50106535
Synonyms:
(2R,3R,4S,5S)-4-Amino-5-hydroxymethyl-2-[6-(3-iodo-benzylamino)-purin-9-yl]-tetrahydro-furan-3-ol CHEMBL132629
Type:
Small organic molecule
Emp. Form.:
C17H19IN6O3
Mol. Mass.:
482.2756
SMILES:
N[C@@H]1[C@@H](CO)O[C@H]([C@@H]1O)n1cnc2c(NCc3cccc(I)c3)ncnc12
: