Target
D(4) dopamine receptor
Ligand
BDBM85136
Substrate
Meas. Tech.
ChEMBL_60684 (CHEMBL675946)
Ki
3.6±n/a nM
Citation
 Rowley, MBristow, LJHutson, PH Current and novel approaches to the drug treatment of schizophrenia. J Med Chem 44:477-501 (2001)  
Target
Name:
D(4) dopamine receptor
Synonyms:
D(2C) dopamine receptor DOPAMINE D4.2 DRD4 Dopamine D4 receptor
Type:
Enzyme
Mol. Mass.:
48373.19
Organism:
Homo sapiens (Human)
Description:
P21917
Residue:
419
  
Inhibitor
Name:
BDBM85136
Synonyms:
CAS_188942 NGD 94-1 | NSC_188942
Type:
Small organic molecule
Emp. Form.:
C18H20N6
Mol. Mass.:
320.3916
SMILES:
C(N1CCN(CC1)c1ncccn1)c1cnc([nH]1)-c1ccccc1
: