Target
Kappa-type opioid receptor
Ligand
BDBM50098461
Substrate
Meas. Tech.
ChEMBL_145706 (CHEMBL753914)
Ki
>7463±n/a nM
Citation
 Thomas, JBHerault, XMRothman, RBAtkinson, RNBurgess, JPMascarella, SWDersch, CMXu, HFlippen-Anderson, JLGeorge, CFCarroll, FI Factors influencing agonist potency and selectivity for the opioid delta receptor are revealed in structure-activity relationship studies of the 4-[(N-substituted-4-piperidinyl)arylamino]-N,N-diethylbenzamides. J Med Chem 44:972-87 (2001)  
Target
Name:
Kappa-type opioid receptor
Synonyms:
KOR-1 OPIATE Kappa Opioid receptor Ror-d
Type:
G Protein-Coupled Receptor (GPCR)
Mol. Mass.:
42692.90
Organism:
Rattus norvegicus (rat)
Description:
P34975
Residue:
380
  
Inhibitor
Name:
BDBM50098461
Synonyms:
CHEMBL355580 | N,N-Diethyl-4-{(3-methoxy-phenyl)-[3-methyl-1-(3-phenyl-allyl)-piperidin-4-yl]-amino}-benzamide
Type:
Small organic molecule
Emp. Form.:
C33H41N3O2
Mol. Mass.:
511.6975
SMILES:
CCN(CC)C(=O)c1ccc(cc1)N([C@@H]1CCN(C\C=C\c2ccccc2)C[C@@H]1C)c1cccc(OC)c1
: