Target
Delta-type opioid receptor
Ligand
BDBM50098447
Substrate
Meas. Tech.
ChEMBL_146896 (CHEMBL751670)
Ki
22±n/a nM
Citation
 Thomas, JBHerault, XMRothman, RBAtkinson, RNBurgess, JPMascarella, SWDersch, CMXu, HFlippen-Anderson, JLGeorge, CFCarroll, FI Factors influencing agonist potency and selectivity for the opioid delta receptor are revealed in structure-activity relationship studies of the 4-[(N-substituted-4-piperidinyl)arylamino]-N,N-diethylbenzamides. J Med Chem 44:972-87 (2001)  
Target
Name:
Delta-type opioid receptor
Synonyms:
Cytochrome P450 3A4 Delta opioid receptor Delta-type opioid receptor (DOR) OPRD_RAT Opioid receptor Opioid receptors; mu & delta Ror-a | Voltage-gated potassium channel
Type:
G Protein-Coupled Receptor (GPCR)
Mol. Mass.:
40465.04
Organism:
Rattus norvegicus (rat)
Description:
Competition binding assays were using CHO-K1 cell membranes expressing the opioid receptor.
Residue:
372
  
Inhibitor
Name:
BDBM50098447
Synonyms:
4-[(1-Allyl-3-methyl-piperidin-4-yl)-(3-methoxy-phenyl)-amino]-N,N-diethyl-benzamide | CHEMBL176037
Type:
Small organic molecule
Emp. Form.:
C27H37N3O2
Mol. Mass.:
435.6016
SMILES:
CCN(CC)C(=O)c1ccc(cc1)N([C@@H]1CCN(CC=C)C[C@@H]1C)c1cccc(OC)c1
: