Target
Translocator protein
Ligand
BDBM50059743
Substrate
Meas. Tech.
ChEMBL_222291 (CHEMBL823051)
IC50
11±n/a nM
Citation
 Anzini, MCappelli, AVomero, SSeeber, MMenziani, MCLanger, THagen, BManzoni, CBourguignon, JJ Mapping and fitting the peripheral benzodiazepine receptor binding site by carboxamide derivatives. Comparison of different approaches to quantitative ligand-receptor interaction modeling. J Med Chem 44:1134-50 (2001)  
Target
Name:
Translocator protein
Synonyms:
Benzodiazepine receptors; peripheral & central Mbr PBR Peripheral benzodiazepine receptor (PBR) TSPO_RAT | Tspo
Type:
Mitochondrion membrane protein
Mol. Mass.:
18945.84
Organism:
Rattus norvegicus (rat)
Description:
Competitive binding experiments were performed on rat kidney mitochondrial membranes.
Residue:
169
  
Inhibitor
Name:
BDBM50059743
Synonyms:
4-Methyl-1-phenyl-isoquinoline-3-carboxylic acid sec-butyl-methyl-amide | CHEMBL278011
Type:
Small organic molecule
Emp. Form.:
C22H24N2O
Mol. Mass.:
332.4388
SMILES:
CCC(C)N(C)C(=O)c1nc(-c2ccccc2)c2ccccc2c1C
: