Target
Cathepsin G
Ligand
BDBM50098853
Substrate
Meas. Tech.
ChEMBL_216698 (CHEMBL820310)
Ki
379±n/a nM
Citation
 Akahoshi, FAshimori, ASakashita, HYoshimura, TImada, TNakajima, MMitsutomi, NKuwahara, SOhtsuka, TFukaya, CMiyazaki, MNakamura, N Synthesis, structure-activity relationships, and pharmacokinetic profiles of nonpeptidic alpha-keto heterocycles as novel inhibitors of human chymase. J Med Chem 44:1286-96 (2001)  
Target
Name:
Cathepsin G
Synonyms:
CATG_HUMAN CTSG
Type:
PROTEIN
Mol. Mass.:
28860.08
Organism:
Homo sapiens (Human)
Description:
ChEMBL_1469016
Residue:
255
  
Inhibitor
Name:
BDBM50098853
Synonyms:
2-(2-{2-[5-Amino-2-(3-methoxy-phenyl)-6-oxo-6H-pyrimidin-1-yl]-acetylamino}-3-phenyl-propionyl)-benzooxazole-5-carboxylic acid methyl ester | CHEMBL26285
Type:
Small organic molecule
Emp. Form.:
C31H27N5O7
Mol. Mass.:
581.5754
SMILES:
COC(=O)c1ccc2oc(nc2c1)C(=O)C(Cc1ccccc1)NC(=O)Cn1c(ncc(N)c1=O)-c1cccc(OC)c1
: