Target
Chymase
Ligand
BDBM87059
Substrate
Meas. Tech.
ChEMBL_197664 (CHEMBL807473)
Ki
13.1±n/a nM
Citation
 Akahoshi, FAshimori, ASakashita, HYoshimura, TImada, TNakajima, MMitsutomi, NKuwahara, SOhtsuka, TFukaya, CMiyazaki, MNakamura, N Synthesis, structure-activity relationships, and pharmacokinetic profiles of nonpeptidic alpha-keto heterocycles as novel inhibitors of human chymase. J Med Chem 44:1286-96 (2001)  
Target
Name:
Chymase
Synonyms:
Alpha-chymase CMA1_HUMAN CYM Mast cell protease I
Type:
Enzyme
Mol. Mass.:
27340.12
Organism:
Homo sapiens (Human)
Description:
Residue:
247
  
Inhibitor
Name:
BDBM87059
Synonyms:
CHEMBL247767 | Chymostatin
Type:
Small organic molecule
Emp. Form.:
C31H41N7O6
Mol. Mass.:
607.7005
SMILES:
CC(C)C[C@H](NC(=O)[C@@H](NC(=O)N[C@@H](Cc1ccccc1)C(O)=O)C1CCNC(N)=N1)C(=O)N[C@@H](Cc1ccccc1)C=O
: