Target
Chymase
Ligand
BDBM50098855
Substrate
Meas. Tech.
ChEMBL_197663 (CHEMBL872602)
Ki
183±n/a nM
Citation
 Akahoshi, FAshimori, ASakashita, HYoshimura, TImada, TNakajima, MMitsutomi, NKuwahara, SOhtsuka, TFukaya, CMiyazaki, MNakamura, N Synthesis, structure-activity relationships, and pharmacokinetic profiles of nonpeptidic alpha-keto heterocycles as novel inhibitors of human chymase. J Med Chem 44:1286-96 (2001)  
Target
Name:
Chymase
Synonyms:
Alpha-chymase CMA1_HUMAN CYM Mast cell protease I
Type:
Enzyme
Mol. Mass.:
27340.12
Organism:
Homo sapiens (Human)
Description:
Residue:
247
  
Inhibitor
Name:
BDBM50098855
Synonyms:
CHEMBL23870 | N-[2-(5-Amino-benzooxazol-2-yl)-1-benzyl-2-oxo-ethyl]-2-[5-amino-2-(4-fluoro-phenyl)-6-oxo-6H-pyrimidin-1-yl]-acetamide
Type:
Small organic molecule
Emp. Form.:
C28H23FN6O4
Mol. Mass.:
526.5184
SMILES:
Nc1ccc2oc(nc2c1)C(=O)C(Cc1ccccc1)NC(=O)Cn1c(ncc(N)c1=O)-c1ccc(F)cc1
: