Target
Chymase
Ligand
BDBM50098844
Substrate
Meas. Tech.
ChEMBL_197663 (CHEMBL872602)
Ki
26.1±n/a nM
Citation
 Akahoshi, FAshimori, ASakashita, HYoshimura, TImada, TNakajima, MMitsutomi, NKuwahara, SOhtsuka, TFukaya, CMiyazaki, MNakamura, N Synthesis, structure-activity relationships, and pharmacokinetic profiles of nonpeptidic alpha-keto heterocycles as novel inhibitors of human chymase. J Med Chem 44:1286-96 (2001)  
Target
Name:
Chymase
Synonyms:
Alpha-chymase CMA1_HUMAN CYM Mast cell protease I
Type:
Enzyme
Mol. Mass.:
27340.12
Organism:
Homo sapiens (Human)
Description:
Residue:
247
  
Inhibitor
Name:
BDBM50098844
Synonyms:
2-(2-{2-[5-Amino-2-(3-chloro-phenyl)-6-oxo-6H-pyrimidin-1-yl]-acetylamino}-3-phenyl-propionyl)-benzooxazole-5-carboxylic acid methyl ester | CHEMBL25830
Type:
Small organic molecule
Emp. Form.:
C30H24ClN5O6
Mol. Mass.:
585.994
SMILES:
COC(=O)c1ccc2oc(nc2c1)C(=O)C(Cc1ccccc1)NC(=O)Cn1c(ncc(N)c1=O)-c1cccc(Cl)c1
: