Target
Chymase
Ligand
BDBM50098876
Substrate
Meas. Tech.
ChEMBL_197662 (CHEMBL807472)
Ki
15.7±n/a nM
Citation
 Akahoshi, FAshimori, ASakashita, HYoshimura, TEda, MImada, TNakajima, MMitsutomi, NKuwahara, SOhtsuka, TFukaya, CMiyazaki, MNakamura, N Synthesis, structure-activity relationships, and pharmacokinetic profiles of nonpeptidic difluoromethylene ketones as novel inhibitors of human chymase. J Med Chem 44:1297-304 (2001)  
Target
Name:
Chymase
Synonyms:
Alpha-chymase CMA1_HUMAN CYM Mast cell protease I
Type:
Enzyme
Mol. Mass.:
27340.12
Organism:
Homo sapiens (Human)
Description:
Residue:
247
  
Inhibitor
Name:
BDBM50098876
Synonyms:
4-{2-[5-Amino-2-(3-fluoro-phenyl)-6-oxo-6H-pyrimidin-1-yl]-acetylamino}-2,2-difluoro-3-oxo-5-phenyl-pentanoic acid benzylamide | CHEMBL284005
Type:
Small organic molecule
Emp. Form.:
C30H26F3N5O4
Mol. Mass.:
577.5537
SMILES:
Nc1cnc(-c2cccc(F)c2)n(CC(=O)NC(Cc2ccccc2)C(=O)C(F)(F)C(=O)NCc2ccccc2)c1=O
: