Target
Chymase
Ligand
BDBM50068894
Substrate
Meas. Tech.
ChEMBL_197662 (CHEMBL807472)
Ki
5.6±n/a nM
Citation
 Akahoshi, FAshimori, ASakashita, HYoshimura, TEda, MImada, TNakajima, MMitsutomi, NKuwahara, SOhtsuka, TFukaya, CMiyazaki, MNakamura, N Synthesis, structure-activity relationships, and pharmacokinetic profiles of nonpeptidic difluoromethylene ketones as novel inhibitors of human chymase. J Med Chem 44:1297-304 (2001)  
Target
Name:
Chymase
Synonyms:
Alpha-chymase CMA1_HUMAN CYM Mast cell protease I
Type:
Enzyme
Mol. Mass.:
27340.12
Organism:
Homo sapiens (Human)
Description:
Residue:
247
  
Inhibitor
Name:
BDBM50068894
Synonyms:
3-(4-{[(S)-1-((S)-2-tert-Butoxycarbonylamino-3-methyl-butyryl)-pyrrolidine-2-carbonyl]-amino}-2,2-difluoro-3-oxo-5-phenyl-pentanoylamino)-benzoic acid CHEMBL287318
Type:
Small organic molecule
Emp. Form.:
C33H40F2N4O8
Mol. Mass.:
658.6895
SMILES:
CC(C)[C@H](NC(=O)OC(C)(C)C)C(=O)N1CCC[C@H]1C(=O)NC(Cc1ccccc1)C(=O)C(F)(F)C(=O)Nc1cccc(c1)C(O)=O
: