Target
Chymase
Ligand
BDBM50098877
Substrate
Meas. Tech.
ChEMBL_197662 (CHEMBL807472)
Ki
13.8±n/a nM
Citation
 Akahoshi, FAshimori, ASakashita, HYoshimura, TEda, MImada, TNakajima, MMitsutomi, NKuwahara, SOhtsuka, TFukaya, CMiyazaki, MNakamura, N Synthesis, structure-activity relationships, and pharmacokinetic profiles of nonpeptidic difluoromethylene ketones as novel inhibitors of human chymase. J Med Chem 44:1297-304 (2001)  
Target
Name:
Chymase
Synonyms:
Alpha-chymase CMA1_HUMAN CYM Mast cell protease I
Type:
Enzyme
Mol. Mass.:
27340.12
Organism:
Homo sapiens (Human)
Description:
Residue:
247
  
Inhibitor
Name:
BDBM50098877
Synonyms:
4-{2-[5-Amino-2-(3-methoxy-phenyl)-6-oxo-6H-pyrimidin-1-yl]-acetylamino}-2,2-difluoro-3-oxo-5-phenyl-pentanoic acid benzylamide | CHEMBL283786
Type:
Small organic molecule
Emp. Form.:
C31H29F2N5O5
Mol. Mass.:
589.5893
SMILES:
COc1cccc(c1)-c1ncc(N)c(=O)n1CC(=O)NC(Cc1ccccc1)C(=O)C(F)(F)C(=O)NCc1ccccc1
: